Reaction Details
TargetKynurenine/alpha-aminoadipate aminotransferase, mitochondrial
LigandBDBM107722
Substrate/Competitorn/a
Meas. Tech.ChEMBL_950925 (CHEMBL2349998)
IC50 74±n/a nM
Citation Dounay, ABAnderson, MBechle, BMEvrard, EGan, XKim, JYMcAllister, LAPandit, JRong, SSalafia, MATuttle, JBZawadzke, LEVerhoest, PR PF-04859989 as a template for structure-based drug design: identification of new pyrazole series of irreversible KAT II inhibitors with improved lipophilic efficiency. Bioorg Med Chem Lett23:1961-6 (2013) 
 
Kynurenine/alpha-aminoadipate aminotransferase, mitochondrial
Name:Kynurenine/alpha-aminoadipate aminotransferase, mitochondrial
Type:Enzyme
Mol. Mass.:47353.09
Organism:Homo sapiens (Human)
Description:Q8N5Z0
Residue:425
BDBM107722
NameBDBM107722
Synonyms:CHEMBL2347114 | US8933095, 5
TypeSmall organic molecule
Emp. Form.C14H13F3N4O2
Mol. Mass.326.2738
SMILESN[C@H]1Cc2c(N(O)C1=O)c(nn2Cc1ccccc1)C(F)(F)F