Reaction Details
TargetKynurenine/alpha-aminoadipate aminotransferase, mitochondrial
LigandBDBM107738
Substrate/Competitorn/a
Meas. Tech.ChEMBL_950925 (CHEMBL2349998)
IC50 66±n/a nM
Citation Dounay, ABAnderson, MBechle, BMEvrard, EGan, XKim, JYMcAllister, LAPandit, JRong, SSalafia, MATuttle, JBZawadzke, LEVerhoest, PR PF-04859989 as a template for structure-based drug design: identification of new pyrazole series of irreversible KAT II inhibitors with improved lipophilic efficiency. Bioorg Med Chem Lett23:1961-6 (2013) 
 
Kynurenine/alpha-aminoadipate aminotransferase, mitochondrial
Name:Kynurenine/alpha-aminoadipate aminotransferase, mitochondrial
Type:Enzyme
Mol. Mass.:47353.09
Organism:Homo sapiens (Human)
Description:Q8N5Z0
Residue:425
BDBM107738
NameBDBM107738
Synonyms:CHEMBL2347113 | US8933095, 22
TypeSmall organic molecule
Emp. Form.C15H18N4O3
Mol. Mass.302.3284
SMILESCOc1cccc(Cc2nn(C)c3N(O)C(=O)[C@@H](N)Cc23)c1