Reaction Details
TargetKynurenine/alpha-aminoadipate aminotransferase, mitochondrial
LigandBDBM107746
Substrate/Competitorn/a
Meas. Tech.ChEMBL_950925 (CHEMBL2349998)
Ki 23±n/a nM
Citation Dounay, ABAnderson, MBechle, BMEvrard, EGan, XKim, JYMcAllister, LAPandit, JRong, SSalafia, MATuttle, JBZawadzke, LEVerhoest, PR PF-04859989 as a template for structure-based drug design: identification of new pyrazole series of irreversible KAT II inhibitors with improved lipophilic efficiency. Bioorg Med Chem Lett23:1961-6 (2013) 
 
Kynurenine/alpha-aminoadipate aminotransferase, mitochondrial
Name:Kynurenine/alpha-aminoadipate aminotransferase, mitochondrial
Type:Enzyme
Mol. Mass.:47353.09
Organism:Homo sapiens (Human)
Description:Q8N5Z0
Residue:425
BDBM107746
NameBDBM107746
Synonyms:CHEMBL2347107 | US8933095, 1
TypeSmall organic molecule
Emp. Form.C13H14N4O2
Mol. Mass.258.2759
SMILESN[C@H]1Cc2cn(Cc3ccccc3)nc2N(O)C1=O