Reaction Details
TargetTyrosine-protein phosphatase non-receptor type 1
LigandBDBM50432421
Substrate/Competitorn/a
Meas. Tech.ChEMBL_953188 (CHEMBL2353863)
Ki 5800±n/a nM
Citation Tang, YBLu, DChen, ZHu, CYang, YTian, JYYe, FWu, LZhang, ZYXiao, Z Design, synthesis and insulin-sensitising effects of novel PTP1B inhibitors. Bioorg Med Chem Lett23:2313-8 (2013) 
 
Tyrosine-protein phosphatase non-receptor type 1
Name:Tyrosine-protein phosphatase non-receptor type 1
Type:Protein phosphatase
Mol. Mass.:49963.76
Organism:Homo sapiens (Human)
Description:Human recombinant GST-fusion PTP1B (1-435).
Residue:435
BDBM50432421
NameBDBM50432421
Synonyms:CHEMBL2349152
TypeSmall organic molecule
Emp. Form.C26H23N3O5S2
Mol. Mass.521.608
SMILESCOc1ccc(cc1)C(=O)CCc1ccc(cc1)C(=O)Nc1ccc(cc1)S(=O)(=O)Nc1nccs1