Reaction Details
TargetCX3C chemokine receptor 1
LigandBDBM50177607
Substrate/Competitorn/a
Meas. Tech.ChEMBL_953474 (CHEMBL2351085)
Ki 770±n/a nM
Citation Karlström, SNordvall, GSohn, DHettman, ATurek, DÅhlin, KKers, AClaesson, MSlivo, CLo-Alfredsson, YPetersson, CBessidskaia, GSvensson, PHRein, TJerning, EMalmberg, ÅAhlgen, CRay, CVares, LIvanov, VJohansson, R Substituted 7-amino-5-thio-thiazolo[4,5-d]pyrimidines as potent and selective antagonists of the fractalkine receptor (CX3CR1). J Med Chem56:3177-90 (2013) 
 
CX3C chemokine receptor 1
Name:CX3C chemokine receptor 1
Type:PROTEIN
Mol. Mass.:40399.45
Organism:Homo sapiens (Human)
Description:ChEMBL_953474
Residue:355
BDBM50177607
NameBDBM50177607
Synonyms:(R)-2-(2-amino-5-(benzylthio)thiazolo[4,5-d]pyrimidin-7-ylamino)butan-1-ol | CHEMBL274737
TypeSmall organic molecule
Emp. Form.C16H19N5OS2
Mol. Mass.361.485
SMILESCC[C@H](CO)Nc1nc(SCc2ccccc2)nc2nc(N)sc12