Reaction Details
TargetCX3C chemokine receptor 1
LigandBDBM50432455
Substrate/Competitorn/a
Meas. Tech.ChEMBL_953474 (CHEMBL2351085)
Ki 8.3±n/a nM
Citation Karlström, SNordvall, GSohn, DHettman, ATurek, DÅhlin, KKers, AClaesson, MSlivo, CLo-Alfredsson, YPetersson, CBessidskaia, GSvensson, PHRein, TJerning, EMalmberg, ÅAhlgen, CRay, CVares, LIvanov, VJohansson, R Substituted 7-amino-5-thio-thiazolo[4,5-d]pyrimidines as potent and selective antagonists of the fractalkine receptor (CX3CR1). J Med Chem56:3177-90 (2013) 
 
CX3C chemokine receptor 1
Name:CX3C chemokine receptor 1
Type:PROTEIN
Mol. Mass.:40399.45
Organism:Homo sapiens (Human)
Description:ChEMBL_953474
Residue:355
BDBM50432455
NameBDBM50432455
Synonyms:CHEMBL2349303
TypeSmall organic molecule
Emp. Form.C19H23N5O2S2
Mol. Mass.417.548
SMILESCOC(=O)[C@@H](CC(C)C)Nc1nc(SCc2ccccc2)nc2nc(N)sc12