Reaction Details
TargetBaculoviral IAP repeat-containing protein 2
LigandBDBM50432754
Substrate/Competitorn/a
Meas. Tech.ChEMBL_952937 (CHEMBL2351926)
Ki 5.0±n/a nM
Citation Sheng, RSun, HLiu, LLu, JMcEachern, DWang, GWen, JMin, PDu, ZLu, HKang, SGuo, MYang, DWang, S A potent bivalent Smac mimetic (SM-1200) achieving rapid, complete, and durable tumor regression in mice. J Med Chem56:3969-79 (2013) 
 
Baculoviral IAP repeat-containing protein 2
Name:Baculoviral IAP repeat-containing protein 2
Type:Protein
Mol. Mass.:69900.47
Organism:Homo sapiens (Human)
Description:Q13490
Residue:618
BDBM50432754
NameBDBM50432754
Synonyms:CHEMBL2348614
TypeSmall organic molecule
Emp. Form.C64H76N10O8
Mol. Mass.1113.3504
SMILESCN[C@@H](C)C(=O)N[C@H]1CN(CC[C@H]2CC[C@H](N2C1=O)C(=O)NC(c1ccccc1)c1ccccc1)C(=O)Cc1ccc(CC(=O)N2CC[C@H]3CC[C@H](N3C(=O)[C@H](C2)NC(=O)[C@H](C)NC)C(=O)NC(c2ccccc2)c2ccccc2)cc1