Reaction Details
TargetE3 ubiquitin-protein ligase XIAP
LigandBDBM50432754
Substrate/Competitorn/a
Meas. Tech.ChEMBL_952938 (CHEMBL2351927)
Ki 1.3±n/a nM
Citation Sheng, RSun, HLiu, LLu, JMcEachern, DWang, GWen, JMin, PDu, ZLu, HKang, SGuo, MYang, DWang, S A potent bivalent Smac mimetic (SM-1200) achieving rapid, complete, and durable tumor regression in mice. J Med Chem56:3969-79 (2013) 
 
E3 ubiquitin-protein ligase XIAP
Name:E3 ubiquitin-protein ligase XIAP
Type:Protein
Mol. Mass.:56685.27
Organism:Homo sapiens (Human)
Description:P98170
Residue:497
BDBM50432754
NameBDBM50432754
Synonyms:CHEMBL2348614
TypeSmall organic molecule
Emp. Form.C64H76N10O8
Mol. Mass.1113.3504
SMILESCN[C@@H](C)C(=O)N[C@H]1CN(CC[C@H]2CC[C@H](N2C1=O)C(=O)NC(c1ccccc1)c1ccccc1)C(=O)Cc1ccc(CC(=O)N2CC[C@H]3CC[C@H](N3C(=O)[C@H](C2)NC(=O)[C@H](C)NC)C(=O)NC(c2ccccc2)c2ccccc2)cc1