Reaction Details
TargetJAK3/JAK1
LigandBDBM50433252
Substrate/Competitorn/a
Meas. Tech.ChEMBL_957627 (CHEMBL2378510)
IC50 240±n/a nM
Citation Lynch, SMDeVicente, JHermann, JCJaime-Figueroa, SJin, SKuglstatter, ALi, HLovey, AMenke, JNiu, LPatel, VRoy, DSoth, MSteiner, STivitmahaisoon, PVu, MDYee, C Strategic use of conformational bias and structure based design to identify potent JAK3 inhibitors with improved selectivity against the JAK family and the kinome. Bioorg Med Chem Lett23:2793-800 (2013) 
 
JAK3/JAK1
Name:JAK3/JAK1
Synonyms:Tyrosine-protein kinase JAK1/JAK3
Type:n/a
Mol. Mass.:n/a
Description:ASSAY_ID of ChEMBL is 2193386
Components:This complex has 2 components.
Component 1
Name:Tyrosine-protein kinase JAK3
Type:Protein
Mol. Mass.:125111.08
Organism:Homo sapiens (Human)
Description:P52333
Residue:1124
Component 2
Name:Tyrosine-protein kinase JAK1
Synonyms:JAK-1 JAK1A JAK1_HUMAN Janus kinase 1 (JAK1) | Janus kinase 1 JAK1
Type:Protein
Mol. Mass.:133293.73
Organism:Homo sapiens (Human)
Description:P23458
Residue:1154
BDBM50433252
NameBDBM50433252
Synonyms:CHEMBL2376144
TypeSmall organic molecule
Emp. Form.C22H19ClN8O2
Mol. Mass.462.892
SMILESC[C@@H](NC(=O)c1c[nH]c2ncc(nc12)-c1nn(C)c2cc(Cl)ccc12)C(=O)N1CC(C1)C#N