Reaction Details
TargetD-amino-acid oxidase
LigandBDBM36181
Substrate/Competitorn/a
Meas. Tech.ChEMBL_957002 (CHEMBL2378384)
Kd 2300±n/a nM
Citation Hopkins, SCHeffernan, MLSaraswat, LDBowen, CAMelnick, LHardy, LWOrsini, MAAllen, MSKoch, PSpear, KLFoglesong, RJSoukri, MChytil, MFang, QKJones, SWVarney, MAPanatier, AOliet, SHPollegioni, LPiubelli, LMolla, GNardini, MLarge, TH Structural, kinetic, and pharmacodynamic mechanisms of D-amino acid oxidase inhibition by small molecules. J Med Chem56:3710-24 (2013) 
 
D-amino-acid oxidase
Name:D-amino-acid oxidase
Type:Homodimer
Mol. Mass.:39476.06
Organism:Homo sapiens (Human)
Description:P14920
Residue:347
BDBM36181
NameBDBM36181
Synonyms:SODIUM BENZOATE benzoic acid | benzoic acid-d5
TypeGuest
Emp. Form.C7H5O2
Mol. Mass.121.1139
SMILES[O-]C(=O)c1ccccc1