Reaction Details
TargetD-amino-acid oxidase
LigandBDBM50433371
Substrate/Competitorn/a
Meas. Tech.ChEMBL_957000 (CHEMBL2378382)
Ki 190±n/a nM
Citation Hopkins, SCHeffernan, MLSaraswat, LDBowen, CAMelnick, LHardy, LWOrsini, MAAllen, MSKoch, PSpear, KLFoglesong, RJSoukri, MChytil, MFang, QKJones, SWVarney, MAPanatier, AOliet, SHPollegioni, LPiubelli, LMolla, GNardini, MLarge, TH Structural, kinetic, and pharmacodynamic mechanisms of D-amino acid oxidase inhibition by small molecules. J Med Chem56:3710-24 (2013) 
 
D-amino-acid oxidase
Name:D-amino-acid oxidase
Type:Homodimer
Mol. Mass.:39476.06
Organism:Homo sapiens (Human)
Description:P14920
Residue:347
BDBM50433371
NameBDBM50433371
Synonyms:CHEMBL2375519
TypeSmall organic molecule
Emp. Form.C15H13NO3
Mol. Mass.255.2686
SMILESOC(=O)c1cc2occ(CCc3ccccc3)c2[nH]1