Reaction Details
TargetSerine/threonine-protein kinase PLK1
LigandBDBM50433414
Substrate/Competitorn/a
Meas. Tech.ChEMBL_958514 (CHEMBL2383286)
IC50 120±n/a nM
Citation Murugan, RNPark, JELim, DAhn, MCheong, CKwon, TNam, KYChoi, SHKim, BYYoon, DYYaffe, MBYu, DYLee, KSBang, JK Development of cyclic peptomer inhibitors targeting the polo-box domain of polo-like kinase 1. Bioorg Med Chem21:2623-34 (2013) 
 
Serine/threonine-protein kinase PLK1
Name:Serine/threonine-protein kinase PLK1
Type:Serine/threonine-protein kinase
Mol. Mass.:68277.16
Organism:Homo sapiens (Human)
Description:P53350
Residue:603
BDBM50433414
NameBDBM50433414
Synonyms:CHEMBL2380650
TypeSmall organic molecule
Emp. Form.C71H102N16O22
Mol. Mass.1531.6636
SMILESCC[C@H](C)[C@H](NC(=O)[C@H](C)NC(=O)[C@@H](NC(=O)[C@H](CO)NC(=O)[C@H](Cc1cnc[nH]1)NC(=O)[C@H](CC(C)C)NC(=O)[C@@H]1CCCN1C(=O)[C@@H]1CCCN1C(=O)[C@H](CC(O)=O)NC(=O)[C@H](Cc1ccccc1)NC(=O)[C@@H](NC(=O)[C@H](CCC(O)=O)NC(C)=O)[C@@H](C)O)[C@@H](C)O)C(=O)N[C@@H](Cc1ccc(O)cc1)C(N)=O