Reaction Details
TargetSerine/threonine-protein kinase PLK1
LigandBDBM50433417
Substrate/Competitorn/a
Meas. Tech.ChEMBL_958514 (CHEMBL2383286)
IC50 8500±n/a nM
Citation Murugan, RNPark, JELim, DAhn, MCheong, CKwon, TNam, KYChoi, SHKim, BYYoon, DYYaffe, MBYu, DYLee, KSBang, JK Development of cyclic peptomer inhibitors targeting the polo-box domain of polo-like kinase 1. Bioorg Med Chem21:2623-34 (2013) 
 
Serine/threonine-protein kinase PLK1
Name:Serine/threonine-protein kinase PLK1
Type:Serine/threonine-protein kinase
Mol. Mass.:68277.16
Organism:Homo sapiens (Human)
Description:P53350
Residue:603
BDBM50433417
NameBDBM50433417
Synonyms:CHEMBL2380653
TypeSmall organic molecule
Emp. Form.C36H51N10O12PS
Mol. Mass.878.889
SMILESCC(C)C[C@@H]1NC(=O)CN(CCc2c[nH]c3ccccc23)C(=O)CSC[C@@H](NC(=O)[C@@H](NC(=O)[C@H](CO)NC(=O)[C@H](Cc2cnc[nH]2)NC1=O)[C@@H](C)OP(O)(O)=O)C(N)=O