Reaction Details
TargetAurora kinase A
LigandBDBM50433636
Substrate/Competitorn/a
Meas. Tech.ChEMBL_959028 (CHEMBL2382841)
IC50 2.0±n/a nM
Citation Karra, SXiao, YChen, XLiu-Bujalski, LHuck, BSutton, AGoutopoulos, AAskew, BJosephson, KJiang, XShutes, AShankar, VNoonan, TGarcia-Berrios, GDong, RDhanabal, MTian, HWang, ZClark, AGoodstal, S SAR and evaluation of novel 5H-benzo[c][1,8]naphthyridin-6-one analogs as Aurora kinase inhibitors. Bioorg Med Chem Lett23:3081-7 (2013) 
 
Aurora kinase A
Name:Aurora kinase A
Type:Serine/threonine-protein kinase
Mol. Mass.:45830.98
Organism:Homo sapiens (Human)
Description:O14965
Residue:403
BDBM50433636
NameBDBM50433636
Synonyms:CHEMBL2380829
TypeSmall organic molecule
Emp. Form.C25H16F2N4O2
Mol. Mass.442.4169
SMILESFc1cccc(C(=O)Nc2ccc(Nc3ccnc4[nH]c(=O)c5ccccc5c34)cc2)c1F