Reaction Details
TargetAurora kinase B
LigandBDBM50433643
Substrate/Competitorn/a
Meas. Tech.ChEMBL_959027 (CHEMBL2382840)
IC50 2.0±n/a nM
Citation Karra, SXiao, YChen, XLiu-Bujalski, LHuck, BSutton, AGoutopoulos, AAskew, BJosephson, KJiang, XShutes, AShankar, VNoonan, TGarcia-Berrios, GDong, RDhanabal, MTian, HWang, ZClark, AGoodstal, S SAR and evaluation of novel 5H-benzo[c][1,8]naphthyridin-6-one analogs as Aurora kinase inhibitors. Bioorg Med Chem Lett23:3081-7 (2013) 
 
Aurora kinase B
Name:Aurora kinase B
Type:Protein
Mol. Mass.:39327.72
Organism:Homo sapiens (Human)
Description:Q96GD4
Residue:344
BDBM50433643
NameBDBM50433643
Synonyms:CHEMBL2380839
TypeSmall organic molecule
Emp. Form.C26H20N4O3
Mol. Mass.436.462
SMILESCOc1ccccc1C(=O)Nc1ccc(Nc2ccnc3[nH]c(=O)c4ccccc4c23)cc1