Reaction Details
TargetPlatelet-activating factor acetylhydrolase
LigandBDBM50433664
Substrate/Competitorn/a
Meas. Tech.ChEMBL_959030 (CHEMBL2382963)
IC50 0.550000±n/a nM
Citation Wang, KXu, WZhang, WMo, MWang, YShen, J Triazole derivatives: a series of Darapladib analogues as orally active Lp-PLA2 inhibitors. Bioorg Med Chem Lett23:2897-901 (2013) 
 
Platelet-activating factor acetylhydrolase
Name:Platelet-activating factor acetylhydrolase
Type:PROTEIN
Mol. Mass.:50084.41
Organism:Homo sapiens (Human)
Description:ChEMBL_156212
Residue:441
BDBM50433664
NameBDBM50433664
Synonyms:CHEMBL2380968
TypeSmall organic molecule
Emp. Form.C38H41F4N7OS
Mol. Mass.719.837
SMILESCN(C)CCCN(C)Cc1nnc(Cn2c3CCCc3c(=O)nc2SCc2ccc(F)cc2)n1Cc1ccc(cc1)-c1ccc(cc1)C(F)(F)F