Reaction Details
TargetGlucose-dependent insulinotropic receptor
LigandBDBM50433855
Substrate/Competitorn/a
Meas. Tech.ChEMBL_959597 (CHEMBL2382542)
IC50 758±n/a nM
Citation Scott, JSBrocklehurst, KJBrown, HSClarke, DSCoe, HGroombridge, SDLaber, DMacFaul, PAMcKerrecher, DSchofield, P Conformational restriction in a series of GPR119 agonists: differences in pharmacology between mouse and human. Bioorg Med Chem Lett23:3175-9 (2013) 
 
Glucose-dependent insulinotropic receptor
Name:Glucose-dependent insulinotropic receptor
Type:PROTEIN
Mol. Mass.:37009.07
Organism:Mus musculus
Description:ChEMBL_1506420
Residue:335
BDBM50433855
NameBDBM50433855
Synonyms:CHEMBL2382411
TypeSmall organic molecule
Emp. Form.C20H18F4N6O3
Mol. Mass.466.3889
SMILESFC1(F)CC(OC(=O)N2CCN(CC2)c2ncc(OCc3ccncc3C#N)cn2)C1(F)F