Reaction Details
TargetGlucose-dependent insulinotropic receptor
LigandBDBM50433856
Substrate/Competitorn/a
Meas. Tech.ChEMBL_959597 (CHEMBL2382542)
IC50 9.0±n/a nM
Citation Scott, JSBrocklehurst, KJBrown, HSClarke, DSCoe, HGroombridge, SDLaber, DMacFaul, PAMcKerrecher, DSchofield, P Conformational restriction in a series of GPR119 agonists: differences in pharmacology between mouse and human. Bioorg Med Chem Lett23:3175-9 (2013) 
 
Glucose-dependent insulinotropic receptor
Name:Glucose-dependent insulinotropic receptor
Type:PROTEIN
Mol. Mass.:37009.07
Organism:Mus musculus
Description:ChEMBL_1506420
Residue:335
BDBM50433856
NameBDBM50433856
Synonyms:CHEMBL2382410
TypeSmall organic molecule
Emp. Form.C22H26N6O3
Mol. Mass.422.4802
SMILESCC(C)(C)OC(=O)N1C2CCC1CN(C2)c1ncc(OCc2ccncc2C#N)cn1