Reaction Details
TargetGlucose-dependent insulinotropic receptor
LigandBDBM50433861
Substrate/Competitorn/a
Meas. Tech.ChEMBL_959597 (CHEMBL2382542)
IC50 5.0±n/a nM
Citation Scott, JSBrocklehurst, KJBrown, HSClarke, DSCoe, HGroombridge, SDLaber, DMacFaul, PAMcKerrecher, DSchofield, P Conformational restriction in a series of GPR119 agonists: differences in pharmacology between mouse and human. Bioorg Med Chem Lett23:3175-9 (2013) 
 
Glucose-dependent insulinotropic receptor
Name:Glucose-dependent insulinotropic receptor
Type:PROTEIN
Mol. Mass.:37009.07
Organism:Mus musculus
Description:ChEMBL_1506420
Residue:335
BDBM50433861
NameBDBM50433861
Synonyms:CHEMBL2382409
TypeSmall organic molecule
Emp. Form.C23H30N4O5S
Mol. Mass.474.573
SMILESCC(C)(C)OC(=O)N1C2CCC1CN(C2)c1ncc(OCc2ccc(cc2)S(C)(=O)=O)cn1