Reaction Details
TargetGlucose-dependent insulinotropic receptor
LigandBDBM50420842
Substrate/Competitorn/a
Meas. Tech.ChEMBL_959598 (CHEMBL2382543)
IC50 1.000000±n/a nM
Citation Scott, JSBrocklehurst, KJBrown, HSClarke, DSCoe, HGroombridge, SDLaber, DMacFaul, PAMcKerrecher, DSchofield, P Conformational restriction in a series of GPR119 agonists: differences in pharmacology between mouse and human. Bioorg Med Chem Lett23:3175-9 (2013) 
 
Glucose-dependent insulinotropic receptor
Name:Glucose-dependent insulinotropic receptor
Type:Protein
Mol. Mass.:36901.49
Organism:Homo sapiens (Human)
Description:Q8TDV5
Residue:335
BDBM50420842
NameBDBM50420842
Synonyms:CHEMBL2086684
TypeSmall organic molecule
Emp. Form.C21H26N6O3
Mol. Mass.410.4695
SMILESC[C@@H]1CN(CCN1c1ncc(OCc2ccncc2C#N)cn1)C(=O)OC(C)(C)C