Reaction Details
TargetGlucose-dependent insulinotropic receptor
LigandBDBM50420871
Substrate/Competitorn/a
Meas. Tech.ChEMBL_959598 (CHEMBL2382543)
IC50 351±n/a nM
Citation Scott, JSBrocklehurst, KJBrown, HSClarke, DSCoe, HGroombridge, SDLaber, DMacFaul, PAMcKerrecher, DSchofield, P Conformational restriction in a series of GPR119 agonists: differences in pharmacology between mouse and human. Bioorg Med Chem Lett23:3175-9 (2013) 
 
Glucose-dependent insulinotropic receptor
Name:Glucose-dependent insulinotropic receptor
Type:Protein
Mol. Mass.:36901.49
Organism:Homo sapiens (Human)
Description:Q8TDV5
Residue:335
BDBM50420871
NameBDBM50420871
Synonyms:CHEMBL2086650
TypeSmall organic molecule
Emp. Form.C21H28N4O5S
Mol. Mass.448.536
SMILESCC(C)(C)OC(=O)N1CCN(CC1)c1ncc(OCc2ccc(cc2)S(C)(=O)=O)cn1