Reaction Details
TargetAtypical chemokine receptor 3
LigandBDBM50434055
Substrate/Competitorn/a
Meas. Tech.ChEMBL_958224 (CHEMBL2384567)
IC50 5270±n/a nM
Citation Yoshikawa, YOishi, SKubo, TTanahara, NFujii, NFuruya, T Optimized method of G-protein-coupled receptor homology modeling: its application to the discovery of novel CXCR7 ligands. J Med Chem56:4236-51 (2013) 
 
Atypical chemokine receptor 3
Name:Atypical chemokine receptor 3
Type:Enzyme
Mol. Mass.:41498.84
Organism:Homo sapiens (Human)
Description:P25106
Residue:362
BDBM50434055
NameBDBM50434055
Synonyms:CHEMBL2381215
TypeSmall organic molecule
Emp. Form.C20H23ClN2OS2
Mol. Mass.406.992
SMILESCC1CCCCN1CCNC(=O)c1cc2CSc3cc(Cl)ccc3-c2s1