Reaction Details
TargetAtypical chemokine receptor 3
LigandBDBM50434063
Substrate/Competitorn/a
Meas. Tech.ChEMBL_958224 (CHEMBL2384567)
IC50 2160±n/a nM
Citation Yoshikawa, YOishi, SKubo, TTanahara, NFujii, NFuruya, T Optimized method of G-protein-coupled receptor homology modeling: its application to the discovery of novel CXCR7 ligands. J Med Chem56:4236-51 (2013) 
 
Atypical chemokine receptor 3
Name:Atypical chemokine receptor 3
Type:Enzyme
Mol. Mass.:41498.84
Organism:Homo sapiens (Human)
Description:P25106
Residue:362
BDBM50434063
NameBDBM50434063
Synonyms:CHEMBL2381333
TypeSmall organic molecule
Emp. Form.C22H30ClN3O2S
Mol. Mass.436.011
SMILESCCC1CCCCN1CCCNC(=O)CSc1cc(=O)n(C)c2ccc(Cl)cc12