Reaction Details
TargetAtypical chemokine receptor 3
LigandBDBM50434066
Substrate/Competitorn/a
Meas. Tech.ChEMBL_958224 (CHEMBL2384567)
IC50 1290±n/a nM
Citation Yoshikawa, YOishi, SKubo, TTanahara, NFujii, NFuruya, T Optimized method of G-protein-coupled receptor homology modeling: its application to the discovery of novel CXCR7 ligands. J Med Chem56:4236-51 (2013) 
 
Atypical chemokine receptor 3
Name:Atypical chemokine receptor 3
Type:Enzyme
Mol. Mass.:41498.84
Organism:Homo sapiens (Human)
Description:P25106
Residue:362
BDBM50434066
NameBDBM50434066
Synonyms:CHEMBL2381331
TypeSmall organic molecule
Emp. Form.C21H27NO4
Mol. Mass.357.4434
SMILESCC1CCCN(CC(O)COc2ccc3c4CCCc4c(=O)oc3c2)C1