Reaction Details
TargetSteroid hormone receptor ERR1
LigandBDBM50434098
Substrate/Competitorn/a
Meas. Tech.ChEMBL_958456 (CHEMBL2383097)
IC50 41±n/a nM
Citation Xu, SZhuang, XPan, XZhang, ZDuan, LLiu, YZhang, LRen, XDing, K 1-Phenyl-4-benzoyl-1H-1,2,3-triazoles as orally bioavailable transcriptional function suppressors of estrogen-related receptora. J Med Chem56:4631-40 (2013) 
 
Steroid hormone receptor ERR1
Name:Steroid hormone receptor ERR1
Type:PROTEIN
Mol. Mass.:45508.08
Organism:Homo sapiens (Human)
Description:ChEMBL_1499891
Residue:423
BDBM50434098
NameBDBM50434098
Synonyms:CHEMBL2381477
TypeSmall organic molecule
Emp. Form.C18H18N4O
Mol. Mass.306.3617
SMILESCC(C)c1ccc(cc1)-n1cc(nn1)C(=O)c1ccccc1N