Reaction Details
TargetChymase
LigandBDBM50434121
Substrate/Competitorn/a
Meas. Tech.ChEMBL_958460 (CHEMBL2383101)
IC50 570000±n/a nM
Citation Taylor, SJPadyana, AKAbeywardane, ALiang, SHao, MHDe Lombaert, SProudfoot, JFarmer, BSLi, XCollins, BMartin, LAlbaugh, DRHill-Drzewi, MPullen, SSTakahashi, H Discovery of potent, selective chymase inhibitors via fragment linking strategies. J Med Chem56:4465-81 (2013) 
 
Chymase
Name:Chymase
Type:Enzyme
Mol. Mass.:27340.12
Organism:Homo sapiens (Human)
Description:n/a
Residue:247
BDBM50434121
NameBDBM50434121
Synonyms:CHEMBL2381492
TypeSmall organic molecule
Emp. Form.C8H6BrNO
Mol. Mass.212.043
SMILESBrc1ccc2CC(=O)Nc2c1