Reaction Details
TargetE3 ubiquitin-protein ligase Mdm2
LigandBDBM50434290
Substrate/Competitorn/a
Meas. Tech.ChEMBL_961694 (CHEMBL2389364)
IC50 23±n/a nM
Citation Vu, BWovkulich, PPizzolato, GLovey, ADing, QJiang, NLiu, JJZhao, CGlenn, KWen, YTovar, CPackman, KVassilev, LGraves, B Discovery of RG7112: A Small-Molecule MDM2 Inhibitor in Clinical Development. ACS Med Chem Lett4:466-9 (2013) 
 
E3 ubiquitin-protein ligase Mdm2
Name:E3 ubiquitin-protein ligase Mdm2
Type:Oncoprotein
Mol. Mass.:55196.54
Organism:Homo sapiens (Human)
Description:Q00987
Residue:491
BDBM50434290
NameBDBM50434290
Synonyms:CHEMBL2386343
TypeSmall organic molecule
Emp. Form.C36H42Cl2N4O3
Mol. Mass.649.65
SMILESCCOc1cc(ccc1C1=N[C@@](C)(c2ccc(Cl)cc2)[C@](C)(N1C(=O)N1CCN(CC1)C(C)=O)c1ccc(Cl)cc1)C(C)(C)C