Reaction Details
TargetProstaglandin D2 receptor 2
LigandBDBM50434451
Substrate/Competitorn/a
Meas. Tech.ChEMBL_960712 (CHEMBL2390448)
IC50 5.0±n/a nM
Citation Andrés, MBravo, MBuil, MACalbet, MCastro, JDomènech, TEichhorn, PFerrer, MGómez, ELehner, MDMoreno, IRoberts, RSSevilla, S 2-(1H-Pyrazol-4-yl)acetic acids as CRTh2 antagonists. Bioorg Med Chem Lett23:3349-53 (2013) 
 
Prostaglandin D2 receptor 2
Name:Prostaglandin D2 receptor 2
Type:Enzyme
Mol. Mass.:43295.45
Organism:Homo sapiens (Human)
Description:Q9Y5Y4
Residue:395
BDBM50434451
NameBDBM50434451
Synonyms:CHEMBL2385124
TypeSmall organic molecule
Emp. Form.C24H20FNO4S
Mol. Mass.437.483
SMILESCc1c(Cc2ccccc2S(=O)(=O)c2ccccc2)c2cc(F)ccc2n1CC(O)=O