Reaction Details
TargetProstaglandin D2 receptor 2
LigandBDBM50434452
Substrate/Competitorn/a
Meas. Tech.ChEMBL_960738 (CHEMBL2390624)
IC50 4.0±n/a nM
Citation Andrés, MBravo, MBuil, MACalbet, MCastro, JDomènech, TEichhorn, PFerrer, MGómez, ELehner, MDMoreno, IRoberts, RSSevilla, S 2-(1H-Pyrazol-4-yl)acetic acids as CRTh2 antagonists. Bioorg Med Chem Lett23:3349-53 (2013) 
 
Prostaglandin D2 receptor 2
Name:Prostaglandin D2 receptor 2
Type:Enzyme
Mol. Mass.:43295.45
Organism:Homo sapiens (Human)
Description:Q9Y5Y4
Residue:395
BDBM50434452
NameBDBM50434452
Synonyms:CHEMBL2385113
TypeSmall organic molecule
Emp. Form.C24H21N3O4S
Mol. Mass.447.506
SMILESCc1c(CC(O)=O)c(nn1Cc1ccccc1S(=O)(=O)c1ccccc1)-c1ccncc1