Reaction Details
TargetP2Y purinoceptor 11
LigandBDBM50435012
Substrate/Competitorn/a
Meas. Tech.ChEMBL_963120 (CHEMBL2390599)
EC50 1500±n/a nM
Citation Azran, SFörster, DDanino, ONadel, YReiser, GFischer, B Highly efficient biocompatible neuroprotectants with dual activity as antioxidants and P2Y receptor agonists. J Med Chem56:4938-52 (2013) 
 
P2Y purinoceptor 11
Name:P2Y purinoceptor 11
Type:PROTEIN
Mol. Mass.:40366.02
Organism:Homo sapiens (Human)
Description:ChEMBL_1362532
Residue:374
BDBM50435012
NameBDBM50435012
Synonyms:CHEMBL2386490
TypeSmall organic molecule
Emp. Form.C18H21N5O11P2S
Mol. Mass.577.399
SMILESCSc1nc(N)c2ncn([C@@H]3O[C@H](COP(O)(=O)OP(O)(O)=O)[C@H](O)[C@H]3OC(=O)c3ccccc3)c2n1