Reaction Details
Target5-hydroxytryptamine receptor 3A
LigandBDBM82561
Substrate/Competitorn/a
Meas. Tech.ChEMBL_966037 (CHEMBL2394926)
Ki 4.7±n/a nM
Citation Cappelli, AManini, MValenti, SCastriconi, FGiuliani, GAnzini, MBrogi, SButini, SGemma, SCampiani, GGiorgi, GMennuni, LLanza, MGiordani, ACaselli, GLetari, OMakovec, F Synthesis and structure-activity relationship studies in serotonin 5-HT(1A) receptor agonists based on fused pyrrolidone scaffolds. Eur J Med Chem63:85-94 (2013) 
 
5-hydroxytryptamine receptor 3A
Name:5-hydroxytryptamine receptor 3A
Type:Protein
Mol. Mass.:55283.27
Organism:Homo sapiens (Human)
Description:P46098
Residue:478
BDBM82561
NameBDBM82561
Synonyms:CAS_40796-97-2 Tropanyl-3,5 dichlorobenzoate
TypeSmall organic molecule
Emp. Form.C15H17Cl2NO2
Mol. Mass.314.207
SMILESCN1[C@H]2CC[C@@H]1C[C@@H](C2)OC(=O)c1cc(Cl)cc(Cl)c1