Reaction Details
TargetProstacyclin receptor
LigandBDBM23954
Substrate/Competitorn/a
Meas. Tech.ChEMBL_966044 (CHEMBL2394933)
Ki 4.8±n/a nM
Citation Cappelli, AManini, MValenti, SCastriconi, FGiuliani, GAnzini, MBrogi, SButini, SGemma, SCampiani, GGiorgi, GMennuni, LLanza, MGiordani, ACaselli, GLetari, OMakovec, F Synthesis and structure-activity relationship studies in serotonin 5-HT(1A) receptor agonists based on fused pyrrolidone scaffolds. Eur J Med Chem63:85-94 (2013) 
 
Prostacyclin receptor
Name:Prostacyclin receptor
Type:G Protein-Coupled Receptor (GPCR)
Mol. Mass.:40968.22
Organism:Homo sapiens (Human)
Description:The membranes prepared from human platelet were used in binding assay.
Residue:386
BDBM23954
NameBDBM23954
Synonyms:5-[(2E,3aS,4R,5R,6aS)-5-hydroxy-4-[(1E,3S)-3-hydroxy-4-methyloct-1-en-6-yn-1-yl]-octahydropentalen-2-ylidene]pentanoic acid ILOPROST [3H]-Iloprost
Typeradiolabeled ligand
Emp. Form.C22H32O4
Mol. Mass.360.4871
SMILES[H][C@]12C[C@@H](O)[C@H](\C=C\[C@@H](O)C(C)CC#CC)[C@@]1([H])C\C(C2)=C\CCCC(O)=O