Reaction Details
TargetHistamine H1 receptor
LigandBDBM22567
Substrate/Competitorn/a
Meas. Tech.ChEMBL_966185 (CHEMBL2395690)
IC50 1.5±n/a nM
Citation Cappelli, AManini, MValenti, SCastriconi, FGiuliani, GAnzini, MBrogi, SButini, SGemma, SCampiani, GGiorgi, GMennuni, LLanza, MGiordani, ACaselli, GLetari, OMakovec, F Synthesis and structure-activity relationship studies in serotonin 5-HT(1A) receptor agonists based on fused pyrrolidone scaffolds. Eur J Med Chem63:85-94 (2013) 
 
Histamine H1 receptor
Name:Histamine H1 receptor
Type:G Protein-Coupled Receptor (GPCR)
Mol. Mass.:55808.72
Organism:Homo sapiens (Human)
Description:Cell pellets from SK-N-MC cells transfected with human H1 receptor were used in binding assay.
Residue:487
BDBM22567
NameBDBM22567
Synonyms:3H]pyrilamine Dorantamin N-(4-methoxybenzyl)-N ,N -dimethyl-N-pyridin-2-ylethane-1,2-diamine PYRILAMINE [3H]mepyramine | [3H]pyrilamine
Typeradiolabeled ligand
Emp. Form.C17H23N3O
Mol. Mass.285.384
SMILESCOc1ccc(CN(CCN(C)C)c2ccccn2)cc1