Reaction Details
TargetMicrotubule-associated protein 2
LigandBDBM50435183
Substrate/Competitorn/a
Meas. Tech.ChEMBL_963502 (CHEMBL2394383)
EC50>200000±n/a nM
Citation Zhang, PYang, XZhang, FGabelli, SBWang, RZhang, YBhat, SChen, XFurlani, MAmzel, LMLiu, JOMa, D Pyridinylpyrimidines selectively inhibit human methionine aminopeptidase-1. Bioorg Med Chem21:2600-17 (2013) 
 
Microtubule-associated protein 2
Name:Microtubule-associated protein 2
Type:PROTEIN
Mol. Mass.:199423.64
Organism:Homo sapiens (Human)
Description:ChEMBL_107603
Residue:1827
BDBM50435183
NameBDBM50435183
Synonyms:CHEMBL2392933
TypeSmall organic molecule
Emp. Form.C27H26Cl2N4
Mol. Mass.477.428
SMILESCc1nc(nc(NCC(CCCc2ccccc2)c2ccccc2)c1Cl)-c1ccc(Cl)cn1