Reaction Details
TargetMicrotubule-associated protein 2
LigandBDBM50435197
Substrate/Competitorn/a
Meas. Tech.ChEMBL_963502 (CHEMBL2394383)
EC50>100000±n/a nM
Citation Zhang, PYang, XZhang, FGabelli, SBWang, RZhang, YBhat, SChen, XFurlani, MAmzel, LMLiu, JOMa, D Pyridinylpyrimidines selectively inhibit human methionine aminopeptidase-1. Bioorg Med Chem21:2600-17 (2013) 
 
Microtubule-associated protein 2
Name:Microtubule-associated protein 2
Type:PROTEIN
Mol. Mass.:199423.64
Organism:Homo sapiens (Human)
Description:ChEMBL_107603
Residue:1827
BDBM50435197
NameBDBM50435197
Synonyms:CHEMBL2392919
TypeSmall organic molecule
Emp. Form.C26H25Cl2N5
Mol. Mass.478.416
SMILESCc1nc(nc(NC[C@H](NCCc2ccccc2)c2ccccc2)c1Cl)-c1ccc(Cl)cn1