Reaction Details
TargetMicrotubule-associated protein 2
LigandBDBM50435230
Substrate/Competitorn/a
Meas. Tech.ChEMBL_963502 (CHEMBL2394383)
IC50 14000±n/a nM
Citation Zhang, PYang, XZhang, FGabelli, SBWang, RZhang, YBhat, SChen, XFurlani, MAmzel, LMLiu, JOMa, D Pyridinylpyrimidines selectively inhibit human methionine aminopeptidase-1. Bioorg Med Chem21:2600-17 (2013) 
 
Microtubule-associated protein 2
Name:Microtubule-associated protein 2
Type:PROTEIN
Mol. Mass.:199423.64
Organism:Homo sapiens (Human)
Description:ChEMBL_107603
Residue:1827
BDBM50435230
NameBDBM50435230
Synonyms:CHEMBL2392770
TypeSmall organic molecule
Emp. Form.C11H11ClN4
Mol. Mass.234.685
SMILESCNc1nc(nc(C)c1Cl)-c1ccccn1