Reaction Details
TargetMethionine aminopeptidase 1
LigandBDBM50435220
Substrate/Competitorn/a
Meas. Tech.ChEMBL_963503 (CHEMBL2394384)
IC50 1300±n/a nM
Citation Zhang, PYang, XZhang, FGabelli, SBWang, RZhang, YBhat, SChen, XFurlani, MAmzel, LMLiu, JOMa, D Pyridinylpyrimidines selectively inhibit human methionine aminopeptidase-1. Bioorg Med Chem21:2600-17 (2013) 
 
Methionine aminopeptidase 1
Name:Methionine aminopeptidase 1
Type:Enzyme
Mol. Mass.:43220.79
Organism:Homo sapiens (Human)
Description:MetAP1 with an N-terminal six histidine tag was expressed in baculovirus infected sf9 cells.
Residue:386
BDBM50435220
NameBDBM50435220
Synonyms:CHEMBL2392897
TypeSmall organic molecule
Emp. Form.C26H34ClN7
Mol. Mass.480.048
SMILESCc1nc(nc(NC[C@H](NCCCCN2CCNCC2)c2ccccc2)c1Cl)-c1ccccn1