Reaction Details
TargetSerine/threonine-protein kinase PLK1
LigandBDBM50435732
Substrate/Competitorn/a
Meas. Tech.ChEMBL_965405 (CHEMBL2394892)
IC50 1.000000±n/a nM
Citation Nie, ZFeher, VNatala, SMcBride, CKiryanov, AJones, BLam, BLiu, YKaldor, SStafford, JHikami, KUchiyama, NKawamoto, THikichi, YMatsumoto, SAmano, NZhang, LHosfield, DSkene, RZou, HCao, XIchikawa, T Discovery of TAK-960: an orally available small molecule inhibitor of polo-like kinase 1 (PLK1). Bioorg Med Chem Lett23:3662-6 (2013) 
 
Serine/threonine-protein kinase PLK1
Name:Serine/threonine-protein kinase PLK1
Type:Serine/threonine-protein kinase
Mol. Mass.:68277.16
Organism:Homo sapiens (Human)
Description:P53350
Residue:603
BDBM50435732
NameBDBM50435732
Synonyms:CHEMBL2392556
TypeSmall organic molecule
Emp. Form.C30H41N7O3
Mol. Mass.547.6916
SMILESCOc1cc(ccc1Nc1ncc2N(C)C(=O)[C@@H](CC=C)CN(C3CCCC3)c2n1)C(=O)NC1CCN(C)CC1