Reaction Details
TargetP2Y purinoceptor 1
LigandBDBM50435802
Substrate/Competitorn/a
Meas. Tech.ChEMBL_963568 (CHEMBL2394755)
Ki 90±n/a nM
Citation Ruel, RL'Heureux, AThibeault, CDaris, JPMartel, APrice, LAWu, QHua, JWexler, RRRehfuss, RLam, PY New azole antagonists with high affinity for the P2Y(1) receptor. Bioorg Med Chem Lett23:3519-22 (2013) 
 
P2Y purinoceptor 1
Name:P2Y purinoceptor 1
Type:Enzyme
Mol. Mass.:42090.25
Organism:Homo sapiens (Human)
Description:P47900
Residue:373
BDBM50435802
NameBDBM50435802
Synonyms:CHEMBL2393195
TypeSmall organic molecule
Emp. Form.C20H22N4O3S
Mol. Mass.398.479
SMILESCCOC(=O)c1nnc(Nc2cccnc2Oc2ccccc2C(C)(C)C)s1