Reaction Details
TargetP2Y purinoceptor 1
LigandBDBM50435812
Substrate/Competitorn/a
Meas. Tech.ChEMBL_963568 (CHEMBL2394755)
Ki 7.0±n/a nM
Citation Ruel, RL'Heureux, AThibeault, CDaris, JPMartel, APrice, LAWu, QHua, JWexler, RRRehfuss, RLam, PY New azole antagonists with high affinity for the P2Y(1) receptor. Bioorg Med Chem Lett23:3519-22 (2013) 
 
P2Y purinoceptor 1
Name:P2Y purinoceptor 1
Type:Enzyme
Mol. Mass.:42090.25
Organism:Homo sapiens (Human)
Description:P47900
Residue:373
BDBM50435812
NameBDBM50435812
Synonyms:CHEMBL2393201
TypeSmall organic molecule
Emp. Form.C24H21F3N4OS
Mol. Mass.470.51
SMILESCC(C)(C)c1ccccc1Oc1ncccc1Nc1nnc(s1)-c1ccc(cc1)C(F)(F)F