Reaction Details
TargetP2Y purinoceptor 1
LigandBDBM50435824
Substrate/Competitorn/a
Meas. Tech.ChEMBL_963568 (CHEMBL2394755)
Ki 25±n/a nM
Citation Ruel, RL'Heureux, AThibeault, CDaris, JPMartel, APrice, LAWu, QHua, JWexler, RRRehfuss, RLam, PY New azole antagonists with high affinity for the P2Y(1) receptor. Bioorg Med Chem Lett23:3519-22 (2013) 
 
P2Y purinoceptor 1
Name:P2Y purinoceptor 1
Type:Enzyme
Mol. Mass.:42090.25
Organism:Homo sapiens (Human)
Description:P47900
Residue:373
BDBM50435824
NameBDBM50435824
Synonyms:CHEMBL2393214
TypeSmall organic molecule
Emp. Form.C23H22N4OS
Mol. Mass.402.512
SMILESCC(C)(C)c1ccccc1Oc1ncccc1Nc1nc(ns1)-c1ccccc1