Reaction Details
TargetUbiquitin carboxyl-terminal hydrolase 7
LigandBDBM50436149
Substrate/Competitorn/a
Meas. Tech.ChEMBL_968437 (CHEMBL2400588)
IC50 22600±n/a nM
Citation Yamaguchi, MMiyazaki, MKodrasov, MPRotinsulu, HLosung, FMangindaan, REde Voogd, NJYokosawa, HNicholson, BTsukamoto, S Spongiacidin C, a pyrrole alkaloid from the marine sponge Stylissa massa, functions as a USP7 inhibitor. Bioorg Med Chem Lett23:3884-6 (2013) 
 
Ubiquitin carboxyl-terminal hydrolase 7
Name:Ubiquitin carboxyl-terminal hydrolase 7
Type:PROTEIN
Mol. Mass.:128274.45
Organism:Homo sapiens (Human)
Description:ChEMBL_1469483
Residue:1102
BDBM50436149
NameBDBM50436149
Synonyms:CHEMBL2398214
TypeSmall organic molecule
Emp. Form.C26H30ClN3O
Mol. Mass.435.989
SMILESCCN(CCCNC(=O)c1ccc2nc3CCCCc3c(Cl)c2c1)Cc1ccccc1