Reaction Details
TargetTransforming protein RhoA
LigandBDBM50436223
Substrate/Competitorn/a
Meas. Tech.ChEMBL_966397 (CHEMBL2398834)
IC50 1600±n/a nM
Citation Bell, JLHaak, AJWade, SMKirchhoff, PDNeubig, RRLarsen, SD Optimization of novel nipecotic bis(amide) inhibitors of the Rho/MKL1/SRF transcriptional pathway as potential anti-metastasis agents. Bioorg Med Chem Lett23:3826-32 (2013) 
 
Transforming protein RhoA
Name:Transforming protein RhoA
Type:PROTEIN
Mol. Mass.:21766.89
Organism:Homo sapiens (Human)
Description:ChEMBL_966397
Residue:193
BDBM50436223
NameBDBM50436223
Synonyms:CHEMBL2398698
TypeSmall organic molecule
Emp. Form.C28H24F6N2O2
Mol. Mass.534.4928
SMILESFC(F)(F)c1cc(cc(c1)C(F)(F)F)C(=O)N1CCCC(C1)C(=O)Nc1cccc(Cc2ccccc2)c1