Reaction Details
TargetTransforming protein RhoA
LigandBDBM50436224
Substrate/Competitorn/a
Meas. Tech.ChEMBL_966397 (CHEMBL2398834)
IC50 1500±n/a nM
Citation Bell, JLHaak, AJWade, SMKirchhoff, PDNeubig, RRLarsen, SD Optimization of novel nipecotic bis(amide) inhibitors of the Rho/MKL1/SRF transcriptional pathway as potential anti-metastasis agents. Bioorg Med Chem Lett23:3826-32 (2013) 
 
Transforming protein RhoA
Name:Transforming protein RhoA
Type:PROTEIN
Mol. Mass.:21766.89
Organism:Homo sapiens (Human)
Description:ChEMBL_966397
Residue:193
BDBM50436224
NameBDBM50436224
Synonyms:CHEMBL2398697
TypeSmall organic molecule
Emp. Form.C27H22F6N2O3
Mol. Mass.536.4656
SMILESFC(F)(F)c1cc(cc(c1)C(F)(F)F)C(=O)N1CCCC(C1)C(=O)Nc1cccc(Oc2ccccc2)c1