Reaction Details
TargetTransforming protein RhoA
LigandBDBM50436236
Substrate/Competitorn/a
Meas. Tech.ChEMBL_966397 (CHEMBL2398834)
IC50 6400±n/a nM
Citation Bell, JLHaak, AJWade, SMKirchhoff, PDNeubig, RRLarsen, SD Optimization of novel nipecotic bis(amide) inhibitors of the Rho/MKL1/SRF transcriptional pathway as potential anti-metastasis agents. Bioorg Med Chem Lett23:3826-32 (2013) 
 
Transforming protein RhoA
Name:Transforming protein RhoA
Type:PROTEIN
Mol. Mass.:21766.89
Organism:Homo sapiens (Human)
Description:ChEMBL_966397
Residue:193
BDBM50436236
NameBDBM50436236
Synonyms:CHEMBL2398678
TypeSmall organic molecule
Emp. Form.C23H21ClN2O3
Mol. Mass.408.877
SMILESClc1ccc(NC(=O)C2CCCN(C2)C(=O)c2cccc(c2)-c2ccco2)cc1