Reaction Details
TargetTransforming protein RhoA
LigandBDBM50436239
Substrate/Competitorn/a
Meas. Tech.ChEMBL_966397 (CHEMBL2398834)
IC50 10000±n/a nM
Citation Bell, JLHaak, AJWade, SMKirchhoff, PDNeubig, RRLarsen, SD Optimization of novel nipecotic bis(amide) inhibitors of the Rho/MKL1/SRF transcriptional pathway as potential anti-metastasis agents. Bioorg Med Chem Lett23:3826-32 (2013) 
 
Transforming protein RhoA
Name:Transforming protein RhoA
Type:PROTEIN
Mol. Mass.:21766.89
Organism:Homo sapiens (Human)
Description:ChEMBL_966397
Residue:193
BDBM50436239
NameBDBM50436239
Synonyms:CHEMBL2398674
TypeSmall organic molecule
Emp. Form.C24H24N2O3S
Mol. Mass.420.524
SMILESCSc1cccc(NC(=O)C2CCCN(C2)C(=O)c2cccc(c2)-c2ccco2)c1