Reaction Details
TargetTransforming protein RhoA
LigandBDBM50436252
Substrate/Competitorn/a
Meas. Tech.ChEMBL_966397 (CHEMBL2398834)
IC50 12000±n/a nM
Citation Bell, JLHaak, AJWade, SMKirchhoff, PDNeubig, RRLarsen, SD Optimization of novel nipecotic bis(amide) inhibitors of the Rho/MKL1/SRF transcriptional pathway as potential anti-metastasis agents. Bioorg Med Chem Lett23:3826-32 (2013) 
 
Transforming protein RhoA
Name:Transforming protein RhoA
Type:PROTEIN
Mol. Mass.:21766.89
Organism:Homo sapiens (Human)
Description:ChEMBL_966397
Residue:193
BDBM50436252
NameBDBM50436252
Synonyms:CHEMBL2398704
TypeSmall organic molecule
Emp. Form.C24H19F6N3O3
Mol. Mass.511.4164
SMILESFC(F)(F)c1cc(cc(c1)C(F)(F)F)C(=O)N1CCCC(C1)C(=O)Nc1cccc(c1)-c1cnco1