Reaction Details
TargetC-C chemokine receptor type 1
LigandBDBM50436288
Substrate/Competitorn/a
Meas. Tech.ChEMBL_966433 (CHEMBL2399021)
IC50 1.6±n/a nM
Citation Gardner, DSSantella, JBDuncia, JVCarter, PHDhar, TGWu, HGuo, WCavallaro, CVan Kirk, KYarde, MBriceno, SWGrafstrom, RRLiu, RPatel, SRTebben, AJCamac, DKhan, JWatson, AYang, GRose, AFoster, WRCvijic, MEDavies, PHynes, J The discovery of BMS-457, a potent and selective CCR1 antagonist. Bioorg Med Chem Lett23:3833-40 (2013) 
 
C-C chemokine receptor type 1
Name:C-C chemokine receptor type 1
Type:Enzyme
Mol. Mass.:41180.69
Organism:Homo sapiens (Human)
Description:P32246
Residue:355
BDBM50436288
NameBDBM50436288
Synonyms:CHEMBL2398728
TypeSmall organic molecule
Emp. Form.C24H35ClN2O4
Mol. Mass.450.999
SMILESCC(C)[C@@H](NC(=O)[C@H]1CC[C@@H](O)C1)C(=O)N1CC[C@](O)(c2ccc(Cl)cc2)C(C)(C)C1