Reaction Details
TargetCytochrome P450 3A4
LigandBDBM50436458
Substrate/Competitorn/a
Meas. Tech.ChEMBL_967911 (CHEMBL2400727)
IC50>10000±n/a nM
Citation Furet, PGuagnano, VFairhurst, RAImbach-Weese, PBruce, IKnapp, MFritsch, CBlasco, FBlanz, JAichholz, RHamon, JFabbro, DCaravatti, G Discovery of NVP-BYL719 a potent and selective phosphatidylinositol-3 kinase alpha inhibitor selected for clinical evaluation. Bioorg Med Chem Lett23:3741-8 (2013) 
 
Cytochrome P450 3A4
Name:Cytochrome P450 3A4
Type:Enzyme
Mol. Mass.:57349.57
Organism:Homo sapiens (Human)
Description:n/a
Residue:503
BDBM50436458
NameBDBM50436458
Synonyms:CHEMBL2397192
TypeSmall organic molecule
Emp. Form.C19H20N6O2S
Mol. Mass.396.466
SMILESCc1nc(NC(=O)N2CCC[C@H]2C(N)=O)sc1-c1ccnc(c1)C1(CC1)C#N