Reaction Details
TargetPhosphatidylinositol 4,5-bisphosphate 3-kinase catalytic subunit alpha isoform
LigandBDBM50436448
Substrate/Competitorn/a
Meas. Tech.ChEMBL_967916 (CHEMBL2400732)
IC50 7.5±n/a nM
Citation Furet, PGuagnano, VFairhurst, RAImbach-Weese, PBruce, IKnapp, MFritsch, CBlasco, FBlanz, JAichholz, RHamon, JFabbro, DCaravatti, G Discovery of NVP-BYL719 a potent and selective phosphatidylinositol-3 kinase alpha inhibitor selected for clinical evaluation. Bioorg Med Chem Lett23:3741-8 (2013) 
 
Phosphatidylinositol 4,5-bisphosphate 3-kinase catalytic subunit alpha isoform
Name:Phosphatidylinositol 4,5-bisphosphate 3-kinase catalytic subunit alpha isoform
Type:Enzyme Subunit
Mol. Mass.:124294.87
Organism:Homo sapiens (Human)
Description:P42336
Residue:1068
BDBM50436448
NameBDBM50436448
Synonyms:CHEMBL2397186
TypeSmall organic molecule
Emp. Form.C18H24N6O2S
Mol. Mass.388.487
SMILESCc1nc(NC(=O)N2CCC[C@H]2C(N)=O)sc1-c1ccnc(n1)C(C)(C)C